BDBM50183601 (+/-)-(R)-4-Methyl-1-indalol::CHEMBL202751
SMILES Cc1cccc2[C@H](O)CCc12
InChI Key InChIKey=JTUTZTVFJIHGGX-SNVBAGLBSA-N
Data  2 IC50
  Tab Delimited (TSV)   2D SDfile   Computed 3D by Vconf -m prep SDfile
Find this compound or compounds like it in BindingDB:
Activity Spreadsheet -- Enzyme Inhibition Constant Data from BindingDB
Found 2 hits for monomerid = 50183601
TargetUDP-glucuronosyltransferase 2B7(Homo sapiens (Human))
University Of Helsinki
Curated by ChEMBL
LigandPNGBDBM50183601((+/-)-(R)-4-Methyl-1-indalol | CHEMBL202751)
Affinity DataIC50:  3.17E+5nM. Assay description: Inhibition of UGT2B7
In DepthDetails ArticlePubMed
TargetUDP-glucuronosyltransferase 2B17(Homo sapiens (Human))
University Of Helsinki
Curated by ChEMBL
LigandPNGBDBM50183601((+/-)-(R)-4-Methyl-1-indalol | CHEMBL202751)
Affinity DataIC50:  6.82E+5nM. Assay description: Inhibition of UGT2B17
In DepthDetails ArticlePubMed