BDBM50183607 (+)-(R)-1-Naphthalen-1-ylethanol::CHEMBL378554
SMILES C[C@@H](O)c1cccc2ccccc12
InChI Key InChIKey=CDRQOYRPWJULJN-SECBINFHSA-N
Data  2 IC50
  Tab Delimited (TSV)   2D SDfile   Computed 3D by Vconf -m prep SDfile
Find this compound or compounds like it in BindingDB:
Activity Spreadsheet -- Enzyme Inhibition Constant Data from BindingDB
Found 2 hits for monomerid = 50183607
TargetUDP-glucuronosyltransferase 2B17(Homo sapiens (Human))
University Of Helsinki
Curated by ChEMBL
LigandPNGBDBM50183607((+)-(R)-1-Naphthalen-1-ylethanol | CHEMBL378554)
Affinity DataIC50:  3.89E+5nM. Assay description: Inhibition of UGT2B17
In DepthDetails ArticlePubMed
TargetUDP-glucuronosyltransferase 2B7(Homo sapiens (Human))
University Of Helsinki
Curated by ChEMBL
LigandPNGBDBM50183607((+)-(R)-1-Naphthalen-1-ylethanol | CHEMBL378554)
Affinity DataIC50:  1.30E+5nM. Assay description: Inhibition of UGT2B7
In DepthDetails ArticlePubMed