BDBM50183680 4-(3,4-dichlorobenzyl)-2-methylphthalazin-1(2H)-one::CHEMBL204632
SMILES Cn1nc(Cc2ccc(Cl)c(Cl)c2)c2ccccc2c1=O
InChI Key InChIKey=QQEFWLMTNKDQDO-UHFFFAOYSA-N
Data  1 EC50
  Tab Delimited (TSV)   2D SDfile   Computed 3D by Vconf -m prep SDfile
Find this compound or compounds like it in BindingDB:
Activity Spreadsheet -- Enzyme Inhibition Constant Data from BindingDB
Found 1 hit for monomerid = 50183680
TargetAlpha-1D adrenergic receptor(Rattus norvegicus (Rat))
Universidad De Salamanca
Curated by ChEMBL
LigandPNGBDBM50183680(4-(3,4-dichlorobenzyl)-2-methylphthalazin-1(2H)-on...)
Affinity DataEC50:  4.90E+3nM. Assay description: Vasorelaxation of phenylephrine-stimulated Wistar rat aorta contraction
In DepthDetails ArticlePubMed