BDBM50183693 4-(4-chlorobenzyl)-2-butylphthalazin-1(2H)-one::CHEMBL206929
SMILES CCCCn1nc(Cc2ccc(Cl)cc2)c2ccccc2c1=O
InChI Key InChIKey=SYNDWPNJGQHHOC-UHFFFAOYSA-N
Data  1 EC50
  Tab Delimited (TSV)   2D SDfile   Computed 3D by Vconf -m prep SDfile
Find this compound or compounds like it in BindingDB:
Activity Spreadsheet -- Enzyme Inhibition Constant Data from BindingDB
Found 1 hit for monomerid = 50183693
TargetAlpha-1D adrenergic receptor(Rattus norvegicus (Rat))
Universidad De Salamanca
Curated by ChEMBL
LigandPNGBDBM50183693(4-(4-chlorobenzyl)-2-butylphthalazin-1(2H)-one | C...)
Affinity DataEC50: >1.00E+5nM. Assay description: Vasorelaxation of phenylephrine-stimulated Wistar rat aorta contraction
In DepthDetails ArticlePubMed