BDBM50183832 CHEMBL437885::N-(3-chloro-2-fluorophenyl)-7-methoxy-6-(pyrrolidin-1-ylmethyl)quinazolin-4-amine
SMILES COc1cc2ncnc(Nc3cccc(Cl)c3F)c2cc1CN1CCCC1
InChI Key InChIKey=QAAOTANJKRXNSC-UHFFFAOYSA-N
Data  13 IC50
  Tab Delimited (TSV)   2D SDfile   Computed 3D by Vconf -m prep SDfile
Find this compound or compounds like it in BindingDB:
Activity Spreadsheet -- Enzyme Inhibition Constant Data from BindingDB
Found 13 hits for monomerid = 50183832
TargetcAMP-dependent protein kinase catalytic subunit alpha/beta/gamma(Homo sapiens (Human))
Astrazeneca
Curated by ChEMBL
LigandPNGBDBM50183832(CHEMBL437885 | N-(3-chloro-2-fluorophenyl)-7-metho...)
Affinity DataIC50: >1.00E+4nM. Assay description: Inhibition of PKA
In DepthDetails ArticlePubMed
TargetMitogen-activated protein kinase 10/8/9(Homo sapiens (Human))
Astrazeneca
Curated by ChEMBL
LigandPNGBDBM50183832(CHEMBL437885 | N-(3-chloro-2-fluorophenyl)-7-metho...)
Affinity DataIC50: >1.00E+4nM. Assay description: Inhibition of JNK
In DepthDetails ArticlePubMed
TargetSerine/threonine-protein kinase Chk1(Homo sapiens (Human))
Astrazeneca
Curated by ChEMBL
LigandPNGBDBM50183832(CHEMBL437885 | N-(3-chloro-2-fluorophenyl)-7-metho...)
Affinity DataIC50: >1.00E+4nM. Assay description: Inhibition of CHK1
In DepthDetails ArticlePubMed
TargetRho-associated protein kinase 2(Homo sapiens (Human))
Astrazeneca
Curated by ChEMBL
LigandPNGBDBM50183832(CHEMBL437885 | N-(3-chloro-2-fluorophenyl)-7-metho...)
Affinity DataIC50: >1.00E+4nM. Assay description: Inhibition of ROCK2
In DepthDetails ArticlePubMed
TargetEpidermal growth factor receptor(Homo sapiens (Human))
Astrazeneca
Curated by ChEMBL
LigandPNGBDBM50183832(CHEMBL437885 | N-(3-chloro-2-fluorophenyl)-7-metho...)
Affinity DataIC50:  360nM. Assay description: Inhibition of EGFR in presence of 2 uM ATP
In DepthDetails ArticlePubMed
TargetMitogen-activated protein kinase 11/12/13/14(Homo sapiens (Human))
Astrazeneca
Curated by ChEMBL
LigandPNGBDBM50183832(CHEMBL437885 | N-(3-chloro-2-fluorophenyl)-7-metho...)
Affinity DataIC50: >1.00E+4nM. Assay description: Inhibition of SAP kinase
In DepthDetails ArticlePubMed
TargetProto-oncogene tyrosine-protein kinase Src(Homo sapiens (Human))
Astrazeneca
Curated by ChEMBL
LigandPNGBDBM50183832(CHEMBL437885 | N-(3-chloro-2-fluorophenyl)-7-metho...)
Affinity DataIC50: >1.00E+4nM. Assay description: Inhibition of Src
In DepthDetails ArticlePubMed
TargetVascular endothelial growth factor receptor 2(Homo sapiens (Human))
Astrazeneca
Curated by ChEMBL
LigandPNGBDBM50183832(CHEMBL437885 | N-(3-chloro-2-fluorophenyl)-7-metho...)
Affinity DataIC50: >1.00E+4nM. Assay description: Inhibition of KDR
In DepthDetails ArticlePubMed
TargetMitogen-activated protein kinase 1(Homo sapiens (Human))
Astrazeneca
Curated by ChEMBL
LigandPNGBDBM50183832(CHEMBL437885 | N-(3-chloro-2-fluorophenyl)-7-metho...)
Affinity DataIC50: >1.00E+4nM. Assay description: Inhibition of MAPK
In DepthDetails ArticlePubMed
TargetGlycogen synthase kinase-3 beta(Homo sapiens (Human))
Astrazeneca
Curated by ChEMBL
LigandPNGBDBM50183832(CHEMBL437885 | N-(3-chloro-2-fluorophenyl)-7-metho...)
Affinity DataIC50: >1.00E+4nM. Assay description: Inhibition of GSK3-beta
In DepthDetails ArticlePubMed
TargetTyrosine-protein kinase Lck(Homo sapiens (Human))
Astrazeneca
Curated by ChEMBL
LigandPNGBDBM50183832(CHEMBL437885 | N-(3-chloro-2-fluorophenyl)-7-metho...)
Affinity DataIC50: >1.00E+4nM. Assay description: Inhibition of LCK
In DepthDetails ArticlePubMed
TargetEpidermal growth factor receptor(Homo sapiens (Human))
Astrazeneca
Curated by ChEMBL
LigandPNGBDBM50183832(CHEMBL437885 | N-(3-chloro-2-fluorophenyl)-7-metho...)
Affinity DataIC50:  360nM. Assay description: Inhibition of EGFR in presence of 2 uM ATP
In DepthDetails ArticlePubMed
TargetSerine/threonine-protein kinase Sgk1(Homo sapiens (Human))
Astrazeneca
Curated by ChEMBL
LigandPNGBDBM50183832(CHEMBL437885 | N-(3-chloro-2-fluorophenyl)-7-metho...)
Affinity DataIC50: >1.00E+4nM. Assay description: Inhibition of SGK
In DepthDetails ArticlePubMed