BDBM50184159 4'-trifluoromethyl-biphenyl-2-carboxylic acid (4-{[((S)-benzylcarbamoyl-phenyl-methyl)-carbamoyl]-methylsulfanyl}-phenyl)-amide::CHEMBL207514
SMILES FC(F)(F)c1ccc(cc1)-c1ccccc1C(=O)Nc1ccc(SCC(=O)N[C@H](C(=O)NCc2ccccc2)c2ccccc2)cc1
InChI Key InChIKey=WYDLORISNUEYQC-UMSFTDKQSA-N
Data  1 IC50
  Tab Delimited (TSV)   2D SDfile   Computed 3D by Vconf -m prep SDfile
Find this compound or compounds like it in BindingDB:
Activity Spreadsheet -- Enzyme Inhibition Constant Data from BindingDB
Found 1 hit for monomerid = 50184159
TargetMicrosomal triglyceride transfer protein large subunit(Homo sapiens (Human))
Pfizer
Curated by ChEMBL
LigandPNGBDBM50184159(4'-trifluoromethyl-biphenyl-2-carboxylic acid (4-{...)
Affinity DataIC50: >100nM. Assay description: Inhibition of MTP in canine liver microsomes
In DepthDetails ArticlePubMed