BDBM50184210 4'-{[5-(4-cyclobutyl-piperazine-1-carbonyl)-pyridin-2-ylamino]-methyl}-3,3'-difluoro-biphenyl-2-carboxylic acid methyl ester::CHEMBL204562
SMILES COC(=O)c1c(F)cccc1-c1ccc(CNc2ccc(cn2)C(=O)N2CCN(CC2)C2CCC2)c(F)c1
InChI Key InChIKey=CBOBIYYERKRFTQ-UHFFFAOYSA-N
Data  1 KI
  Tab Delimited (TSV)   2D SDfile   Computed 3D by Vconf -m prep SDfile
Find this compound or compounds like it in BindingDB:
Activity Spreadsheet -- Enzyme Inhibition Constant Data from BindingDB
Found 1 hit for monomerid = 50184210
TargetB1 bradykinin receptor(Homo sapiens (Human))
Merck Research Laboratories
Curated by ChEMBL
LigandPNGBDBM50184210(4'-{[5-(4-cyclobutyl-piperazine-1-carbonyl)-pyridi...)
Affinity DataKi:  2.90nM. Assay description: Binding affinity to human BK1 receptor
In DepthDetails ArticlePubMed