BDBM50184396 (S)-(-)-8-{4-[2-(butoxy)ethoxy]phenyl}-1-isobutyl-N-(4-{[(4-propyl-4H-1,2,4-triazol-3-yl)methyl]sulfinyl}phenyl)-1,2,3,4-tetrahydro-1-benzazocine-5-carboxamide::CHEMBL203536
SMILES CCCCOCCOc1ccc(cc1)-c1ccc2N(CC(C)C)CCCC(=Cc2c1)C(=O)Nc1ccc(cc1)S(=O)Cc1nncn1CCC
InChI Key InChIKey=AQXIPTPSJDOCRP-UHFFFAOYSA-N
Data  2 IC50
  Tab Delimited (TSV)   2D SDfile   Computed 3D by Vconf -m prep SDfile
Find this compound or compounds like it in BindingDB:
Activity Spreadsheet -- Enzyme Inhibition Constant Data from BindingDB
Found 2 hits for monomerid = 50184396
TargetC-C chemokine receptor type 5(Homo sapiens (Human))
Takeda Pharmaceutical
Curated by ChEMBL
LigandPNGBDBM50184396((S)-(-)-8-{4-[2-(butoxy)ethoxy]phenyl}-1-isobutyl-...)
Affinity DataIC50:  0.190nM. Assay description: Inhibition of membrane fusion between HIV1 JR-FL Env-expressing COS7 cells and MOLT4/CCR5
In DepthDetails ArticlePubMed
TargetC-C chemokine receptor type 5(Homo sapiens (Human))
Takeda Pharmaceutical
Curated by ChEMBL
LigandPNGBDBM50184396((S)-(-)-8-{4-[2-(butoxy)ethoxy]phenyl}-1-isobutyl-...)
Affinity DataIC50:  2.40nM. Assay description: Displacement of [125I]RANTES from CCR5 expressed in CHO cells
In DepthDetails ArticlePubMed