BDBM50184397 CHEMBL1547184
SMILES COc1ccc-2c(NC(c3cccn-23)c2ccc(cc2)N(C)C)c1
InChI Key InChIKey=KUFHEUJHSAJDFW-UHFFFAOYSA-N
Data  4 IC50
  Tab Delimited (TSV)   2D SDfile   Computed 3D by Vconf -m prep SDfile
Find this compound or compounds like it in BindingDB:
Activity Spreadsheet -- Enzyme Inhibition Constant Data from BindingDB
Found 4 hits for monomerid = 50184397
TargetDNA repair protein RAD51 homolog 1(Homo sapiens (Human))
University Of Illinois At Chicago
Curated by ChEMBL
LigandPNGBDBM50184397(CHEMBL1547184)
Affinity DataIC50: >1.00E+5nM. Assay description: Inhibition of Escherichia coli BL21(DE3) expressing human N-terminal 6-histidine/Avi-tagged RAD51 binding to 5'-Alexa488-oligo-dT45 ssDNA preincubate...
In DepthDetails ArticlePubMed
TargetDNA repair protein RAD51 homolog 1(Homo sapiens (Human))
University Of Illinois At Chicago
Curated by ChEMBL
LigandPNGBDBM50184397(CHEMBL1547184)
Affinity DataIC50: >1.00E+5nM. Assay description: Inhibition of human N-terminal 6-histidine/Avi-tagged recombinant RAD51 expressed in Escherichia coli BL21(DE3) assessed as D-loop formation using 5'...
In DepthDetails ArticlePubMed
TargetDNA repair protein RAD51 homolog 1(Homo sapiens (Human))
University Of Illinois At Chicago
Curated by ChEMBL
LigandPNGBDBM50184397(CHEMBL1547184)
Affinity DataIC50:  2.13E+4nM. Assay description: Inhibition of human N-terminal 6-histidine/Avi-tagged recombinant RAD51 expressed in Escherichia coli BL21(DE3) assessed as D-loop formation using 5'...
In DepthDetails ArticlePubMed
TargetDNA repair protein RAD51 homolog 1(Homo sapiens (Human))
University Of Illinois At Chicago
Curated by ChEMBL
LigandPNGBDBM50184397(CHEMBL1547184)
Affinity DataIC50:  1.31E+4nM. Assay description: Inhibition of RAD51-mediated homologous recombination in human HEK293-DR-GFP cells transfected with pCBASce expressing I-Sce-I after 24 hrs following...
In DepthDetails ArticlePubMed