BDBM50184416 CHEMBL3822825
SMILES C[C@H](c1ccn(n1)-c1ccccn1)c1ccc2[nH]c(=O)sc2c1
InChI Key InChIKey=CPNJIZRYNQHWHQ-NSHDSACASA-N
Data  4 IC50
  Tab Delimited (TSV)   2D SDfile   Computed 3D by Vconf -m prep SDfile
Find this compound or compounds like it in BindingDB:
Activity Spreadsheet -- Enzyme Inhibition Constant Data from BindingDB
Found 4 hits for monomerid = 50184416
TargetGlutamate receptor 1(Homo sapiens (Human))
Eli Lilly
Curated by ChEMBL
LigandPNGBDBM50184416(CHEMBL3822825)
Affinity DataIC50:  9.26E+3nM. Assay description: Antagonist activity at human iGluA1 receptor flip isoform expressed in CHO-S cells assessed as inhibition of glutamate-induced increase in intracellu...
In DepthDetails ArticlePubMed
TargetGlutamate receptor 1(Homo sapiens (Human))
Eli Lilly
Curated by ChEMBL
LigandPNGBDBM50184416(CHEMBL3822825)
Affinity DataIC50:  8.33E+4nM. Assay description: Antagonist activity at human iGluA1 receptor flop isoform expressed in CHO-S cells coexpressing TARP gamma-2 assessed as inhibition of glutamate-indu...
In DepthDetails ArticlePubMed
TargetGlutamate receptor 1(Homo sapiens (Human))
Eli Lilly
Curated by ChEMBL
LigandPNGBDBM50184416(CHEMBL3822825)
Affinity DataIC50:  51nM. Assay description: Antagonist activity at human iGluA1 receptor flop isoform expressed in CHO-S cells coexpressing TARP gamma-8 and human EAAT3 assessed as inhibition o...
In DepthDetails ArticlePubMed
TargetCytochrome P450 1A2(Homo sapiens (Human))
Eli Lilly
Curated by ChEMBL
LigandPNGBDBM50184416(CHEMBL3822825)
Affinity DataIC50: >1.00E+4nM. Assay description: Inhibition of human CYP1A2
In DepthDetails ArticlePubMed