BDBM50184446 CHEMBL3823961
SMILES CCOCCN(c1nc(cs1)-c1ccccn1)c1ccc2[nH]c(=O)sc2c1
InChI Key InChIKey=RSDXBKWFUNFRRY-UHFFFAOYSA-N
Data  1 IC50
  Tab Delimited (TSV)   2D SDfile   Computed 3D by Vconf -m prep SDfile
Find this compound or compounds like it in BindingDB:
Activity Spreadsheet -- Enzyme Inhibition Constant Data from BindingDB
Found 1 hit for monomerid = 50184446
TargetGlutamate receptor 1(Homo sapiens (Human))
Eli Lilly
Curated by ChEMBL
LigandPNGBDBM50184446(CHEMBL3823961)
Affinity DataIC50:  22nM. Assay description: Antagonist activity at human iGluA1 receptor flop isoform expressed in CHO-S cells coexpressing TARP gamma-8 and human EAAT3 assessed as inhibition o...
In DepthDetails ArticlePubMed