BDBM50184587 (2R,3aS,6aS)-2-methyl-1-(4-(trifluoromethyl)pyrimidin-2-yl)-octahydropyrrolo[3,4-b]pyrrole::CHEMBL210484
SMILES C[C@@H]1C[C@H]2CNC[C@H]2N1c1nccc(n1)C(F)(F)F
InChI Key InChIKey=BHZWUADTFGRRTH-HRDYMLBCSA-N
Data  3 EC50
  Tab Delimited (TSV)   2D SDfile   Computed 3D by Vconf -m prep SDfile
Find this compound or compounds like it in BindingDB:
Activity Spreadsheet -- Enzyme Inhibition Constant Data from BindingDB
Found 3 hits for monomerid = 50184587
Target5-hydroxytryptamine receptor 2A(Homo sapiens (Human))
Athersys
Curated by ChEMBL
LigandPNGBDBM50184587((2R,3aS,6aS)-2-methyl-1-(4-(trifluoromethyl)pyrimi...)
Affinity DataEC50:  25nM. Assay description: Induction of 5HT2A receptor mediated increase in intracellular calcium concentration in CHO cells
In DepthDetails ArticlePubMed
Target5-hydroxytryptamine receptor 2C(Homo sapiens (Human))
Athersys
Curated by ChEMBL
LigandPNGBDBM50184587((2R,3aS,6aS)-2-methyl-1-(4-(trifluoromethyl)pyrimi...)
Affinity DataEC50:  57nM. Assay description: Induction of 5HT2C receptor mediated increase in intracellular calcium concentration in HEK293 cells
In DepthDetails ArticlePubMed
Target5-hydroxytryptamine receptor 2B(Homo sapiens (Human))
Athersys
Curated by ChEMBL
LigandPNGBDBM50184587((2R,3aS,6aS)-2-methyl-1-(4-(trifluoromethyl)pyrimi...)
Affinity DataEC50:  48nM. Assay description: Induction of 5HT2B receptor mediated increase in intracellular calcium concentration in CHO cells
In DepthDetails ArticlePubMed