BDBM50184649 CHEMBL208574::[benzyloxycarbonylamino-(4-guanidino-phenyl)-methyl]-phosphonic acid bis-(4-methoxy-phenyl) ester trifluoro-acetic acid salt
SMILES [#6]-[#8]-c1ccc(-[#8]P(=O)([#8]-c2ccc(-[#8]-[#6])cc2)[#6](-[#7]-[#6](=O)-[#8]-[#6]-c2ccccc2)-c2ccc(cc2)\[#7]=[#6](\[#7])-[#7])cc1
InChI Key InChIKey=YSQMDAMVSWNHJK-UHFFFAOYSA-N
Data  1 IC50
  Tab Delimited (TSV)   2D SDfile   Computed 3D by Vconf -m prep SDfile
Find this compound or compounds like it in BindingDB:
Activity Spreadsheet -- Enzyme Inhibition Constant Data from BindingDB
Found 1 hit for monomerid = 50184649
TargetUrokinase-type plasminogen activator(Homo sapiens (Human))
Wroc£?Aw University Of Technology
Curated by ChEMBL
LigandPNGBDBM50184649(CHEMBL208574 | [benzyloxycarbonylamino-(4-guanidin...)
Affinity DataIC50:  2.60E+3nM. Assay description: Inhibition of human uPA by chromogenic assay using Cbz-Val-Gly-Arg-pNA as chromogenic substrate
In DepthDetails ArticlePubMed