BDBM50184747 2-(4-(trifluoromethyl)phenyl)-1,2-dihydroindazol-3-one::CHEMBL3144796
SMILES FC(F)(F)c1ccc(cc1)-n1[nH]c2ccccc2c1=O
InChI Key InChIKey=XQRFOKRJVHIBPI-UHFFFAOYSA-N
Data  1 IC50
  Tab Delimited (TSV)   2D SDfile   Computed 3D by Vconf -m prep SDfile
Find this compound or compounds like it in BindingDB:
Activity Spreadsheet -- Enzyme Inhibition Constant Data from BindingDB
Found 1 hit for monomerid = 50184747
TargetTransient receptor potential cation channel subfamily V member 1(Homo sapiens (Human))
Merck Sharp & Dohme
Curated by ChEMBL
LigandPNGBDBM50184747(2-(4-(trifluoromethyl)phenyl)-1,2-dihydroindazol-3...)
Affinity DataIC50:  340nM. Assay description: Antagonist activity against capsaicin-induced intracellular calcium ion increase in CHO cells expressing human TRPV1 in FLIPR assay
In DepthDetails ArticlePubMed