BDBM50184842 CHEMBL534491::N'-[2-(4-fluorophenyl)allyl]-N-isopropylhydrazine hydrochloride
SMILES CC(C)NNCC(=C)c1ccc(F)cc1
InChI Key InChIKey=ZJDCLXVLAISLQT-UHFFFAOYSA-N
Data  1 IC50
  Tab Delimited (TSV)   2D SDfile   Computed 3D by Vconf -m prep SDfile
Find this compound or compounds like it in BindingDB:
Activity Spreadsheet -- Enzyme Inhibition Constant Data from BindingDB
Found 1 hit for monomerid = 50184842
TargetMembrane primary amine oxidase(Rattus norvegicus (Rat))
La Jolla Pharmaceutical
Curated by ChEMBL
LigandPNGBDBM50184842(CHEMBL534491 | N'-[2-(4-fluorophenyl)allyl]-N-isop...)
Affinity DataIC50: >1.00E+3nM. Assay description: Inhibition of SSAO in rat lung
In DepthDetails ArticlePubMed