BDBM50184850 CHEMBL534938::N'-[2-(4-fluorophenyl)allyl]-N-methylhydrazine hydrochloride
SMILES CNNCC(=C)c1ccc(F)cc1
InChI Key InChIKey=WQJDOQJOHFGDMA-UHFFFAOYSA-N
Data  1 IC50
  Tab Delimited (TSV)   2D SDfile   Computed 3D by Vconf -m prep SDfile
Find this compound or compounds like it in BindingDB:
Activity Spreadsheet -- Enzyme Inhibition Constant Data from BindingDB
Found 1 hit for monomerid = 50184850
TargetMembrane primary amine oxidase(Rattus norvegicus (Rat))
La Jolla Pharmaceutical
Curated by ChEMBL
LigandPNGBDBM50184850(CHEMBL534938 | N'-[2-(4-fluorophenyl)allyl]-N-meth...)
Affinity DataIC50:  1.70nM. Assay description: Inhibition of SSAO in rat lung
In DepthDetails ArticlePubMed