BDBM50184921 CHEMBL204881::N'-[4-fluoro-3-(trifluoromethyl)phenyl)-N-[trans-5-(4-methoxyphenyl)bicyclo[3.1.0]hex-2-yl]-N-[3-(4-methyl-1-piperazinyl)propyl]urea
SMILES COc1ccc(cc1)[C@@]12C[C@@H]1[C@@H](CC2)N(CCCN1CCN(C)CC1)C(=O)Nc1ccc(F)c(c1)C(F)(F)F
InChI Key InChIKey=HJNSJDPMBGSSML-OROMBRFGSA-N
Data  1 KI
  Tab Delimited (TSV)   2D SDfile   Computed 3D by Vconf -m prep SDfile
Find this compound or compounds like it in BindingDB:
Activity Spreadsheet -- Enzyme Inhibition Constant Data from BindingDB
Found 1 hit for monomerid = 50184921
TargetMelanin-concentrating hormone receptor 1(Homo sapiens (Human))
Schering-Plough Research Institute
Curated by ChEMBL
LigandPNGBDBM50184921(CHEMBL204881 | N'-[4-fluoro-3-(trifluoromethyl)phe...)
Affinity DataKi:  2.80nM. Assay description: Displacement of [125I]MCH from human MCHR1 expressed in CHO cell
In DepthDetails ArticlePubMed