BDBM50184974 CHEMBL3823057
SMILES CN1CCN(CC1)\C=C1/CCn2c1nc(=O)c1ccccc21
InChI Key InChIKey=NIBTYWBKRBSLHJ-OUKQBFOZSA-N
Data  1 IC50
  Tab Delimited (TSV)   2D SDfile   Computed 3D by Vconf -m prep SDfile
Find this compound or compounds like it in BindingDB:
Activity Spreadsheet -- Enzyme Inhibition Constant Data from BindingDB
Found 1 hit for monomerid = 50184974
TargetTranscription activator BRG1(Homo sapiens (Human))
University Of Cambridge
Curated by ChEMBL
LigandPNGBDBM50184974(CHEMBL3823057)
Affinity DataIC50:  7.30E+3nM. Assay description: Inhibition of His6-tagged human recombinant SMARCA4 bromodomain expressed in Escherichia coli BL21(DE3)-R3-pRARE2 cells after 30 mins using biotinyla...
In DepthDetails ArticlePubMed