BDBM50185192 11-ethyl-6,11-dihydrothiochromeno[4,3-b]indol-8-ol::CHEMBL207550
SMILES CCn1c-2c(CSc3ccccc-23)c2cc(O)ccc12
InChI Key InChIKey=ZUESSZWIIWTSFY-UHFFFAOYSA-N
Data  1 IC50
  Tab Delimited (TSV)   2D SDfile   Computed 3D by Vconf -m prep SDfile
Find this compound or compounds like it in BindingDB:
Activity Spreadsheet -- Enzyme Inhibition Constant Data from BindingDB
Found 1 hit for monomerid = 50185192
TargetAndrogen receptor(Rattus norvegicus (Rat))
Johnson & Johnson Pharmaceutical Research And Development
Curated by ChEMBL
LigandPNGBDBM50185192(11-ethyl-6,11-dihydrothiochromeno[4,3-b]indol-8-ol...)
Affinity DataIC50:  2.30E+3nM. Assay description: Inhibition of rat AR-mediated reporter gene expression in COS7 cells
In DepthDetails ArticlePubMed