BDBM50185198 6,6,11-trimethyl-6,11-dihydrothiochromeno[4,3-b]indole-3,9-diol::CHEMBL379244
SMILES Cn1c-2c(c3ccc(O)cc13)C(C)(C)Sc1cc(O)ccc-21
InChI Key InChIKey=GEZZUFGGOBWPET-UHFFFAOYSA-N
Data  1 IC50
  Tab Delimited (TSV)   2D SDfile   Computed 3D by Vconf -m prep SDfile
Find this compound or compounds like it in BindingDB:
Activity Spreadsheet -- Enzyme Inhibition Constant Data from BindingDB
Found 1 hit for monomerid = 50185198
TargetAndrogen receptor(Rattus norvegicus (Rat))
Johnson & Johnson Pharmaceutical Research And Development
Curated by ChEMBL
LigandPNGBDBM50185198(6,6,11-trimethyl-6,11-dihydrothiochromeno[4,3-b]in...)
Affinity DataIC50:  3.40E+3nM. Assay description: Inhibition of rat AR-mediated reporter gene expression in COS7 cells
In DepthDetails ArticlePubMed