BDBM50185200 3-fluoro-11-methyl-6,11-dihydrothiochromeno[4,3-b]indol-10-ol::CHEMBL383485
SMILES Cn1c-2c(CSc3cc(F)ccc-23)c2cccc(O)c12
InChI Key InChIKey=FAYWWZHEARMADZ-UHFFFAOYSA-N
Data  1 IC50
  Tab Delimited (TSV)   2D SDfile   Computed 3D by Vconf -m prep SDfile
Find this compound or compounds like it in BindingDB:
Activity Spreadsheet -- Enzyme Inhibition Constant Data from BindingDB
Found 1 hit for monomerid = 50185200
TargetAndrogen receptor(Rattus norvegicus (Rat))
Johnson & Johnson Pharmaceutical Research And Development
Curated by ChEMBL
LigandPNGBDBM50185200(3-fluoro-11-methyl-6,11-dihydrothiochromeno[4,3-b]...)
Affinity DataIC50:  3.80E+3nM. Assay description: Inhibition of rat AR-mediated reporter gene expression in COS7 cells
In DepthDetails ArticlePubMed