BDBM50185409 (+/-)-(4aS,6R,8aS)-6-(4-chloro-benzenesulfonyl)-6-(2,5-difluoro-phenyl)-3-propyl-octahydro-benzo[1,2,6]thiadiazine 2,2-dioxide::CHEMBL377367
SMILES CCCN1C[C@@H]2C[C@](CC[C@@H]2NS1(=O)=O)(c1cc(F)ccc1F)S(=O)(=O)c1ccc(Cl)cc1
InChI Key InChIKey=OBEHBYVZGXFFMR-UZQPLGKSSA-N
Data  1 IC50
  Tab Delimited (TSV)   2D SDfile   Computed 3D by Vconf -m prep SDfile
Find this compound or compounds like it in BindingDB:
Activity Spreadsheet -- Enzyme Inhibition Constant Data from BindingDB
Found 1 hit for monomerid = 50185409
LigandPNGBDBM50185409((+/-)-(4aS,6R,8aS)-6-(4-chloro-benzenesulfonyl)-6-...)
Affinity DataIC50:  1.17nM. Assay description: Inhibition of gamma secretase
In DepthDetails ArticlePubMed