BDBM50185428 CHEMBL3824165
SMILES Cn1cc2c(cccc2n1)-c1cc(F)c(CN2CCn3nccc3C2=O)c(F)c1
InChI Key InChIKey=IEJGXIXJQXIESF-UHFFFAOYSA-N
Data  1 EC50
  Tab Delimited (TSV)   2D SDfile   Computed 3D by Vconf -m prep SDfile
Find this compound or compounds like it in BindingDB:
Activity Spreadsheet -- Enzyme Inhibition Constant Data from BindingDB
Found 1 hit for monomerid = 50185428
TargetMuscarinic acetylcholine receptor M1(RAT)
Vanderbilt University Medical Center
Curated by ChEMBL
LigandPNGBDBM50185428(CHEMBL3824165)
Affinity DataEC50: >1.00E+4nM. Assay description: Positive allosteric modulation at rat muscarinic acetylcholine receptor M1 expressed in CHO cells assessed as potentiation of acetylcholine-induced c...
In DepthDetails ArticlePubMed