BDBM50185434 CHEMBL3823302
SMILES C(Oc1cnccc1-c1cnn(c1)-c1ccc(cc1)N1CCOCC1)C1CCNCC1
InChI Key InChIKey=UVBIUGIXVITCEG-UHFFFAOYSA-N
Data  2 IC50
  Tab Delimited (TSV)   2D SDfile   Computed 3D by Vconf -m prep SDfile
Find this compound or compounds like it in BindingDB:
Activity Spreadsheet -- Enzyme Inhibition Constant Data from BindingDB
Found 2 hits for monomerid = 50185434
TargetMaternal embryonic leucine zipper kinase(Homo sapiens (Human))
Novartis Institutes For Biomedical Research
Curated by ChEMBL
LigandPNGBDBM50185434(CHEMBL3823302)
Affinity DataIC50:  6nM. Assay description: Inhibition of MELK catalytic domain (unknown origin) preincubated for 20 mins followed by addition of KinEASE STK S1 peptide as substrate in presence...
In DepthDetails ArticlePubMed
TargetMaternal embryonic leucine zipper kinase(Homo sapiens (Human))
Novartis Institutes For Biomedical Research
Curated by ChEMBL
LigandPNGBDBM50185434(CHEMBL3823302)
Affinity DataIC50:  210nM. Assay description: Inhibition of MELK catalytic domain (unknown origin) preincubated for 20 mins followed by addition of KinEASE STK S1 peptide as substrate in presence...
In DepthDetails ArticlePubMed