BDBM50185442 CHEMBL3823306
SMILES O=C(NCc1ccccn1)c1ccc(cc1)-n1cc(cn1)-c1ccncc1
InChI Key InChIKey=UKGSBPKSNSXMDN-UHFFFAOYSA-N
Data  5 IC50
PDB links: 1 PDB ID matches this monomer.
  Tab Delimited (TSV)   2D SDfile   Computed 3D by Vconf -m prep SDfile
Find this compound or compounds like it in BindingDB:
Activity Spreadsheet -- Enzyme Inhibition Constant Data from BindingDB
Found 5 hits for monomerid = 50185442
TargetMaternal embryonic leucine zipper kinase(Homo sapiens (Human))
Novartis Institutes For Biomedical Research
Curated by ChEMBL
LigandPNGBDBM50185442(CHEMBL3823306)
Affinity DataIC50:  180nM. Assay description: Inhibition of MELK catalytic domain (unknown origin) preincubated for 20 mins followed by addition of KinEASE STK S1 peptide as substrate in presence...
TargetMitogen-activated protein kinase kinase kinase kinase 4(Homo sapiens (Human))
Novartis Institutes For Biomedical Research
Curated by ChEMBL
LigandPNGBDBM50185442(CHEMBL3823306)
Affinity DataIC50: <5.00E+3nM. Assay description: Inhibition of MAP4K4 (unknown origin)
In DepthDetails ArticlePubMed
TargetMaternal embryonic leucine zipper kinase(Homo sapiens (Human))
Novartis Institutes For Biomedical Research
Curated by ChEMBL
LigandPNGBDBM50185442(CHEMBL3823306)
Affinity DataIC50:  1.88E+4nM. Assay description: Inhibition of MELK catalytic domain (unknown origin) preincubated for 20 mins followed by addition of KinEASE STK S1 peptide as substrate in presence...
TargetReceptor-type tyrosine-protein kinase FLT3(Homo sapiens (Human))
Novartis Institutes For Biomedical Research
Curated by ChEMBL
LigandPNGBDBM50185442(CHEMBL3823306)
Affinity DataIC50: <5.00E+3nM. Assay description: Inhibition of FLT3 (unknown origin)
In DepthDetails ArticlePubMed
TargetPlatelet-derived growth factor receptor alpha(Homo sapiens (Human))
Novartis Institutes For Biomedical Research
Curated by ChEMBL
LigandPNGBDBM50185442(CHEMBL3823306)
Affinity DataIC50: <5.00E+3nM. Assay description: Inhibition of PDGFR-alpha (unknown origin)
In DepthDetails ArticlePubMed