BDBM50185452 3-(benzo[d][1,3]dioxol-5-yl)-4-(5-(2-(5,6,7,8-tetrahydro-1,8-naphthyridin-2-yl)ethoxy)-1H-pyrazol-3-yl)butanoic acid::CHEMBL209983
SMILES OC(=O)CC(Cc1cc(OCCc2ccc3CCCNc3n2)n[nH]1)c1ccc2OCOc2c1
InChI Key InChIKey=CTHYLBXDQVAGEJ-UHFFFAOYSA-N
Data  5 IC50
  Tab Delimited (TSV)   2D SDfile   Computed 3D by Vconf -m prep SDfile
Find this compound or compounds like it in BindingDB:
Activity Spreadsheet -- Enzyme Inhibition Constant Data from BindingDB
Found 5 hits for monomerid = 50185452
TargetIntegrin alpha-V/beta-5(Homo sapiens (Human))
Pfizer
Curated by ChEMBL
LigandPNGBDBM50185452(3-(benzo[d][1,3]dioxol-5-yl)-4-(5-(2-(5,6,7,8-tetr...)
Affinity DataIC50:  2.10nM. Assay description: Inhibition of alphavbeta5 integrin in 293 cells
In DepthDetails ArticlePubMed
TargetIntegrin alpha-V/beta-6(Homo sapiens (Human))
Pfizer
Curated by ChEMBL
LigandPNGBDBM50185452(3-(benzo[d][1,3]dioxol-5-yl)-4-(5-(2-(5,6,7,8-tetr...)
Affinity DataIC50:  674nM. Assay description: Inhibition of alphavbeta6 integrin in HT29 cells
In DepthDetails ArticlePubMed
TargetIntegrin alpha-IIb/beta-3(Homo sapiens (Human))
Pfizer
Curated by ChEMBL
LigandPNGBDBM50185452(3-(benzo[d][1,3]dioxol-5-yl)-4-(5-(2-(5,6,7,8-tetr...)
Affinity DataIC50:  81.9nM. Assay description: Inhibition of alpha2bbeta3 integrin by SPRA
In DepthDetails ArticlePubMed
TargetIntegrin alpha-V/beta-3(Homo sapiens (Human))
Pfizer
Curated by ChEMBL
LigandPNGBDBM50185452(3-(benzo[d][1,3]dioxol-5-yl)-4-(5-(2-(5,6,7,8-tetr...)
Affinity DataIC50:  0.710nM. Assay description: Inhibition of alphavbeta3 integrin in 293 cells
In DepthDetails ArticlePubMed
TargetIntegrin alpha-V/beta-3(Homo sapiens (Human))
Pfizer
Curated by ChEMBL
LigandPNGBDBM50185452(3-(benzo[d][1,3]dioxol-5-yl)-4-(5-(2-(5,6,7,8-tetr...)
Affinity DataIC50:  1.20nM. Assay description: Inhibition of alphavbeta3 integrin by SPRA
In DepthDetails ArticlePubMed