BDBM50185477 CHEMBL3823920
SMILES CS(=O)(=O)c1ccc(cc1)-n1cc(cn1)-c1ccncc1
InChI Key InChIKey=PGJUFUGSXPZZIO-UHFFFAOYSA-N
Data  1 IC50
  Tab Delimited (TSV)   2D SDfile   Computed 3D by Vconf -m prep SDfile
Find this compound or compounds like it in BindingDB:
Activity Spreadsheet -- Enzyme Inhibition Constant Data from BindingDB
Found 1 hit for monomerid = 50185477
TargetMaternal embryonic leucine zipper kinase(Homo sapiens (Human))
Novartis Institutes For Biomedical Research
Curated by ChEMBL
LigandPNGBDBM50185477(CHEMBL3823920)
Affinity DataIC50:  400nM. Assay description: Inhibition of MELK catalytic domain (unknown origin) preincubated for 20 mins followed by addition of KinEASE STK S1 peptide as substrate in presence...
In DepthDetails ArticlePubMed