BDBM50185610 CHEMBL3823086
SMILES COc1cc(\C=C\C(=O)OCCc2ccc(N)cc2)ccc1O
InChI Key InChIKey=WVTOBYRUCJPBEE-WEVVVXLNSA-N
Data  1 IC50
  Tab Delimited (TSV)   2D SDfile   Computed 3D by Vconf -m prep SDfile
Find this compound or compounds like it in BindingDB:
Activity Spreadsheet -- Enzyme Inhibition Constant Data from BindingDB
Found 1 hit for monomerid = 50185610
TargetHepatocyte growth factor receptor(Homo sapiens (Human))
University Of Louisiana At Monroe
Curated by ChEMBL
LigandPNGBDBM50185610(CHEMBL3823086)
Affinity DataIC50:  5.20E+3nM. Assay description: Inhibition of recombinant human N-terminal His-tagged cytoplasmic c-MET kinase domain (956 to 1390 residues) phosphorylation expressed in baculovirus...
In DepthDetails ArticlePubMed