BDBM50185686 CHEMBL3823395
SMILES COc1cc(\C=C\C(=O)OCCc2ccc(O)c(O)c2)ccc1N
InChI Key InChIKey=RNRCSBCOTVVEJM-QPJJXVBHSA-N
Data  1 IC50
  Tab Delimited (TSV)   2D SDfile   Computed 3D by Vconf -m prep SDfile
Find this compound or compounds like it in BindingDB:
Activity Spreadsheet -- Enzyme Inhibition Constant Data from BindingDB
Found 1 hit for monomerid = 50185686
TargetHepatocyte growth factor receptor(Homo sapiens (Human))
University Of Louisiana At Monroe
Curated by ChEMBL
LigandPNGBDBM50185686(CHEMBL3823395)
Affinity DataIC50:  6.90E+3nM. Assay description: Inhibition of recombinant human N-terminal His-tagged cytoplasmic c-MET kinase domain (956 to 1390 residues) phosphorylation expressed in baculovirus...
In DepthDetails ArticlePubMed