BDBM50185755 CHEMBL3823054
SMILES Cc1cc(O)c(C)c(C)c1C[C@H](N)C(=O)N[C@H](CCCNC(N)=N)C(=O)N[C@@H](Cc1ccccc1)C(=O)N[C@@H](CCCCN)C(N)=O
InChI Key InChIKey=ASZIDYXNKKAYAC-NFGXINMFSA-N
Data  3 KI  2 IC50
  Tab Delimited (TSV)   2D SDfile   Computed 3D by Vconf -m prep SDfile
Find this compound or compounds like it in BindingDB:
Activity Spreadsheet -- Enzyme Inhibition Constant Data from BindingDB
Found 5 hits for monomerid = 50185755
TargetMu-type opioid receptor(Rattus norvegicus (rat))
Nanjing Medical University
Curated by ChEMBL
LigandPNGBDBM50185755(CHEMBL3823054)
Affinity DataKi:  0.458nM. Assay description: Displacement of [3H]DAMGO from mu-type opioid receptor in rat brain membranes incubated for 2 hrs
In DepthDetails ArticlePubMed
TargetKappa-type opioid receptor(Cavia porcellus (domestic guinea pig))
Nanjing Medical University
Curated by ChEMBL
LigandPNGBDBM50185755(CHEMBL3823054)
Affinity DataKi:  381nM. Assay description: Displacement of [3H]U69,593 from kappa-type opioid receptor in guniea pig brain membranes incubated for 2 hrs
In DepthDetails ArticlePubMed
TargetDelta-type opioid receptor(Rattus norvegicus (rat))
Nanjing Medical University
Curated by ChEMBL
LigandPNGBDBM50185755(CHEMBL3823054)
Affinity DataKi:  2.90E+3nM. Assay description: Displacement of [3H]DSLET from delta-type opioid receptor in rat brain membranes incubated for 2 hrs
In DepthDetails ArticlePubMed
TargetMu-type opioid receptor(GUINEA PIG)
Nanjing Medical University
Curated by ChEMBL
LigandPNGBDBM50185755(CHEMBL3823054)
Affinity DataIC50:  18nM. Assay description: Agonist activity at mu opioid receptor in guinea pig ileum assessed as inhibition of electrically-stimulated muscle contraction
In DepthDetails ArticlePubMed
TargetDelta-type opioid receptor(MOUSE)
Nanjing Medical University
Curated by ChEMBL
LigandPNGBDBM50185755(CHEMBL3823054)
Affinity DataIC50:  290nM. Assay description: Agonist activity at delta opioid receptor in albino mouse vas deferens assessed as inhibition of electrically-stimulated muscle contraction
In DepthDetails ArticlePubMed