BDBM50185868 7-hydroxy-9a-pentyl-1,2,9,9a-tetrahydrofluoren-3-one::CHEMBL381299
SMILES CCCCCC12Cc3cc(O)ccc3C1=CC(=O)CC2
InChI Key InChIKey=WFANMPSCHUWTME-UHFFFAOYSA-N
Data  2 IC50
  Tab Delimited (TSV)   2D SDfile   Computed 3D by Vconf -m prep SDfile
Find this compound or compounds like it in BindingDB:
Activity Spreadsheet -- Enzyme Inhibition Constant Data from BindingDB
Found 2 hits for monomerid = 50185868
TargetEstrogen receptor beta(Homo sapiens (Human))
Merck Research Laboratories
Curated by ChEMBL
LigandPNGBDBM50185868(7-hydroxy-9a-pentyl-1,2,9,9a-tetrahydrofluoren-3-o...)
Affinity DataIC50:  945nM. Assay description: Binding affinity to ERbeta by scintillation proximity assay
In DepthDetails ArticlePubMed
TargetEstrogen receptor(Homo sapiens (Human))
Merck Research Laboratories
Curated by ChEMBL
LigandPNGBDBM50185868(7-hydroxy-9a-pentyl-1,2,9,9a-tetrahydrofluoren-3-o...)
Affinity DataIC50:  3.74E+3nM. Assay description: Binding affinity to ERalpha by scintillation proximity assay
In DepthDetails ArticlePubMed