BDBM50186144 CHEMBL211044::N-{3-[4-hydroxy-1-(3-methylbutyl)-2-oxo-1,2-dihydro-1,8-naphthyridin-3-yl]-1,1-dioxo-4H-1,2,4-benzothiadiazin-7-yl}(piperidin-4-ylamino)sulfonamide
SMILES CC(C)CCn1c2ncccc2c(O)c(C2=Nc3ccc(NS(=O)(=O)NC4CCNCC4)cc3S(=O)(=O)N2)c1=O
InChI Key InChIKey=YSUFGZQXRVPYQN-UHFFFAOYSA-N
Data  1 IC50
  Tab Delimited (TSV)   2D SDfile   Computed 3D by Vconf -m prep SDfile
Find this compound or compounds like it in BindingDB:
Activity Spreadsheet -- Enzyme Inhibition Constant Data from BindingDB
Found 1 hit for monomerid = 50186144
TargetRNA-directed RNA polymerase(Hepatitis C virus)
Abbott Laboratories
Curated by ChEMBL
LigandPNGBDBM50186144(CHEMBL211044 | N-{3-[4-hydroxy-1-(3-methylbutyl)-2...)
Affinity DataIC50:  32nM. Assay description: Inhibition of HCV 1a NS5B RNA polymerase
In DepthDetails ArticlePubMed