BDBM50186198 1-benzyl-4-hydroxy-3-(7-methyl-1,1-dioxo-1,4-dihydro-1lambda*6*-benzo[1,2,4]thiadiazin-3-yl)-1H-[1,8]naphthyridin-2-one::CHEMBL212120
SMILES Cc1ccc2N=C(NS(=O)(=O)c2c1)c1c(O)c2cccnc2n(Cc2ccccc2)c1=O
InChI Key InChIKey=SXYSELLEJCRTPX-UHFFFAOYSA-N
Data  2 IC50
  Tab Delimited (TSV)   2D SDfile   Computed 3D by Vconf -m prep SDfile
Find this compound or compounds like it in BindingDB:
Activity Spreadsheet -- Enzyme Inhibition Constant Data from BindingDB
Found 2 hits for monomerid = 50186198
TargetRNA-directed RNA polymerase(Hepatitis C virus)
Abbott Laboratories
Curated by ChEMBL
LigandPNGBDBM50186198(1-benzyl-4-hydroxy-3-(7-methyl-1,1-dioxo-1,4-dihyd...)
Affinity DataIC50:  2.57E+4nM. Assay description: Inhibition of HCV 1a NS5B RNA polymerase
In DepthDetails ArticlePubMed
TargetRNA-directed RNA polymerase(Hepatitis C virus)
Abbott Laboratories
Curated by ChEMBL
LigandPNGBDBM50186198(1-benzyl-4-hydroxy-3-(7-methyl-1,1-dioxo-1,4-dihyd...)
Affinity DataIC50:  230nM. Assay description: Inhibition of HCV 1b NS5B RNA polymerase
In DepthDetails ArticlePubMed