BDBM50186274 5-(3-(piperidin-1-yl)propoxy)-1,2,3,4-tetrahydroisoquinoline::CHEMBL209188
SMILES C(COc1cccc2CNCCc12)CN1CCCCC1
InChI Key InChIKey=CPIIRFSGNQWTCI-UHFFFAOYSA-N
Data  1 KI
  Tab Delimited (TSV)   2D SDfile   Computed 3D by Vconf -m prep SDfile
Find this compound or compounds like it in BindingDB:
Activity Spreadsheet -- Enzyme Inhibition Constant Data from BindingDB
Found 1 hit for monomerid = 50186274
TargetHistamine H3 receptor(Homo sapiens (Human))
Eli Lilly
Curated by ChEMBL
LigandPNGBDBM50186274(5-(3-(piperidin-1-yl)propoxy)-1,2,3,4-tetrahydrois...)
Affinity DataKi: >300nM. Assay description: Displacement of [3H]N-alpha-methylhistamine from human cloned H3 receptor
In DepthDetails ArticlePubMed