BDBM50186321 3-methoxy-N-(6-methylpyridin-2-yl)benzamide::CHEMBL211801
SMILES COc1cccc(c1)C(=O)Nc1cccc(C)n1
InChI Key InChIKey=RGDXTZSZZQXINX-UHFFFAOYSA-N
Data  2 IC50
  Tab Delimited (TSV)   2D SDfile   Computed 3D by Vconf -m prep SDfile
Find this compound or compounds like it in BindingDB:
Activity Spreadsheet -- Enzyme Inhibition Constant Data from BindingDB
Found 2 hits for monomerid = 50186321
TargetMetabotropic glutamate receptor 5(Rattus norvegicus (Rat))
National Institute On Drug Abuse
Curated by ChEMBL
LigandPNGBDBM50186321(3-methoxy-N-(6-methylpyridin-2-yl)benzamide | CHEM...)
Affinity DataIC50:  9.76E+3nM. Assay description: Inhibition of [3H]MPEP binding to mGluR5 in rat brain membrane
In DepthDetails ArticlePubMed
TargetMetabotropic glutamate receptor 5(Homo sapiens (Human))
National Institute On Drug Abuse
Curated by ChEMBL
LigandPNGBDBM50186321(3-methoxy-N-(6-methylpyridin-2-yl)benzamide | CHEM...)
Affinity DataIC50:  4.60E+4nM. Assay description: Antagonist activity against mGluR5 expressed in CHO cells assessed as inhibition of agonist-induced phosphoinositide hydrolysis
In DepthDetails ArticlePubMed