BDBM50186467 CHEMBL210528::N-(5-(3-(1-acetylpiperazine-4-carbonyl)-4-methoxyphenylthio)thiazol-2-yl)-4-(dimethylamino)benzamide
SMILES COc1ccc(Sc2cnc(NC(=O)c3ccc(cc3)N(C)C)s2)cc1C(=O)N1CCN(CC1)C(C)=O
InChI Key InChIKey=YWVLIRJSHTUKIM-UHFFFAOYSA-N
Data  1 IC50
  Tab Delimited (TSV)   2D SDfile   Computed 3D by Vconf -m prep SDfile
Find this compound or compounds like it in BindingDB:
Activity Spreadsheet -- Enzyme Inhibition Constant Data from BindingDB
Found 1 hit for monomerid = 50186467
TargetTyrosine-protein kinase ITK/TSK(Homo sapiens (Human))
Bristol-Myers Squibb Pharmaceutical Research Institute
Curated by ChEMBL
LigandPNGBDBM50186467(CHEMBL210528 | N-(5-(3-(1-acetylpiperazine-4-carbo...)
Affinity DataIC50:  34nM. Assay description: Inhibition of Itk
In DepthDetails ArticlePubMed