BDBM50186661 1alpha,25-dihydroxy-2-(3'-hydroxypropylidene)-19-norvitamin D3::CHEMBL207469
SMILES C[C@H](CCCC(C)(C)C)C1CCC2\C(CCC[C@]12C)=C\C=C1\C[C@@H](O)C[C@H](O)C1=C
InChI Key InChIKey=NYBIEKRMEJEDBG-IPGRDMQTSA-N
Data  1 KI
  Tab Delimited (TSV)   2D SDfile   Computed 3D by Vconf -m prep SDfile
Find this compound or compounds like it in BindingDB:
Activity Spreadsheet -- Enzyme Inhibition Constant Data from BindingDB
Found 1 hit for monomerid = 50186661
TargetVitamin D3 receptor(Rattus norvegicus)
University Of Wisconsin-Madison
Curated by ChEMBL
LigandPNGBDBM50186661(1alpha,25-dihydroxy-2-(3'-hydroxypropylidene)-19-n...)
Affinity DataKi:  11nM. Assay description: Displacement of [3H]1alpha25-(OH)2D3 from rat recombinant VDR
In DepthDetails ArticlePubMed