BDBM50186711 CHEMBL437115::Cbz-Ile-iPrGln-Ala-LeuVSMe
SMILES CC[C@H](C)[C@H](NC(=O)OCc1ccccc1)C(=O)N[C@@H](CCC(=O)NC(C)C)C(=O)N[C@@H](C)C(=O)N[C@@H](CC(C)C)C=CS(C)(=O)=O
InChI Key InChIKey=LNRJXKOZMRTLHF-SJPHNPNMSA-N
Data  5 IC50
  Tab Delimited (TSV)   2D SDfile   Computed 3D by Vconf -m prep SDfile
Find this compound or compounds like it in BindingDB:
Activity Spreadsheet -- Enzyme Inhibition Constant Data from BindingDB
Found 5 hits for monomerid = 50186711
TargetProteasome subunit beta type-2(Homo sapiens (Human))
Celera
Curated by ChEMBL
LigandPNGBDBM50186711(CHEMBL437115 | Cbz-Ile-iPrGln-Ala-LeuVSMe)
Affinity DataIC50: >1.50E+5nM. Assay description: Inhibition of trypsin-like proteasome activity of human 20S proteasome
In DepthDetails ArticlePubMed
TargetCathepsin S(Homo sapiens (Human))
Celera
Curated by ChEMBL
LigandPNGBDBM50186711(CHEMBL437115 | Cbz-Ile-iPrGln-Ala-LeuVSMe)
Affinity DataIC50:  4.10E+4nM. Assay description: Inhibition of cathepsin S
In DepthDetails ArticlePubMed
TargetProteasome subunit beta type-5(Homo sapiens (Human))
Celera
Curated by ChEMBL
LigandPNGBDBM50186711(CHEMBL437115 | Cbz-Ile-iPrGln-Ala-LeuVSMe)
Affinity DataIC50:  52nM. Assay description: Inhibition of chymotrypsin-like proteasome activity of human 20S proteasome
In DepthDetails ArticlePubMed
TargetCathepsin B(Homo sapiens (Human))
Celera
Curated by ChEMBL
LigandPNGBDBM50186711(CHEMBL437115 | Cbz-Ile-iPrGln-Ala-LeuVSMe)
Affinity DataIC50: >1.50E+5nM. Assay description: Inhibition of cathepsin B
In DepthDetails ArticlePubMed
TargetProteasome subunit beta type-1(Homo sapiens (Human))
Celera
Curated by ChEMBL
LigandPNGBDBM50186711(CHEMBL437115 | Cbz-Ile-iPrGln-Ala-LeuVSMe)
Affinity DataIC50: >1.50E+5nM. Assay description: Inhibition of post glutamyl peptide hydrolase-like proteasome activity of human 20S proteasome
In DepthDetails ArticlePubMed