BDBM50186789 4'-[[(6-chloro-5-fluoro-1H-benzoimidazol-2-ylmethyl)-amino]-(1-cyclopentyl-piperidin-4-yl)-methyl]-biphenyl-3-carbonitrile::CHEMBL379789
SMILES Fc1cc2[nH]c(CNC(C3CCN(CC3)C3CCCC3)c3ccc(cc3)-c3cccc(c3)C#N)nc2cc1Cl
InChI Key InChIKey=OKZJGDJSXQYNID-UHFFFAOYSA-N
Data  2 KI
  Tab Delimited (TSV)   2D SDfile   Computed 3D by Vconf -m prep SDfile
Find this compound or compounds like it in BindingDB:
Activity Spreadsheet -- Enzyme Inhibition Constant Data from BindingDB
Found 2 hits for monomerid = 50186789
TargetMelanin-concentrating hormone receptor 1(Homo sapiens (Human))
Schering-Plough Research Institute
Curated by ChEMBL
LigandPNGBDBM50186789(4'-[[(6-chloro-5-fluoro-1H-benzoimidazol-2-ylmethy...)
Affinity DataKi:  39nM. Assay description: Binding affinity at human MCHR1 assessed as inhibition of MCH-mediated calcium ion influx by FLIPR assay
In DepthDetails ArticlePubMed
TargetMelanin-concentrating hormone receptor 2(Homo sapiens (Human))
Schering-Plough Research Institute
Curated by ChEMBL
LigandPNGBDBM50186789(4'-[[(6-chloro-5-fluoro-1H-benzoimidazol-2-ylmethy...)
Affinity DataKi: >3.00E+3nM. Assay description: Binding affinity at human MCHR2 assessed as inhibition of MCH-mediated calcium ion influx by FLIPR assay
In DepthDetails ArticlePubMed