BDBM50186889 (R)-N-(3-(2,4-dichlorophenyl)-1-oxo-1-(4-(3-((2-(thiophen-2-yl)ethylamino)methyl)pyridin-2-yl)piperazin-1-yl)propan-2-yl)acetamide::CHEMBL380222
SMILES CC(=O)N[C@H](Cc1ccc(Cl)cc1Cl)C(=O)N1CCN(CC1)c1ncccc1CNCCc1cccs1
InChI Key InChIKey=UZFGPUGHLKNQKT-RUZDIDTESA-N
Data  1 KI
  Tab Delimited (TSV)   2D SDfile   Computed 3D by Vconf -m prep SDfile
Find this compound or compounds like it in BindingDB:
Activity Spreadsheet -- Enzyme Inhibition Constant Data from BindingDB
Found 1 hit for monomerid = 50186889
TargetMelanocortin receptor 4(Homo sapiens (Human))
Neurocrine Biosciences
Curated by ChEMBL
LigandPNGBDBM50186889((R)-N-(3-(2,4-dichlorophenyl)-1-oxo-1-(4-(3-((2-(t...)
Affinity DataKi:  21nM. Assay description: Displacement of [125I]NDP-MSH from human MC4R expressed in HEK293 cells
In DepthDetails ArticlePubMed