BDBM50187024 CHEMBL412723
SMILES CSCC[C@H](NC(=O)[C@H](CC(C)C)NC(=O)[C@H](CCCCNC(C)=S)NC(=O)[C@H](CCCCN)NC(=O)[C@H](Cc1cnc[nH]1)NC(=O)[C@H](CCCN=C(N)N)NC(=O)[C@H](CO)NC(=O)[C@@H](NC(=O)[C@H](CO)NC(=O)[C@H](CCC(N)=O)NC(=O)CNC(=O)[C@H](CCCCN)NC(=O)[C@@H](N)CCCCN)[C@@H](C)O)C(=O)N[C@@H](Cc1ccccc1)C(=O)N[C@@H](CCCCN)C(=O)N[C@@H]([C@@H](C)O)C(=O)N[C@@H](CCC(O)=O)C(=O)NCC(O)=O
InChI Key InChIKey=GJAQQMZSKNATJW-LXIYAGRQSA-N
Data  1 IC50
  Tab Delimited (TSV)   2D SDfile   Computed 3D by Vconf -m prep SDfile
Find this compound or compounds like it in BindingDB:
Activity Spreadsheet -- Enzyme Inhibition Constant Data from BindingDB
Found 1 hit for monomerid = 50187024
TargetNAD-dependent protein deacetylase sirtuin-1(Homo sapiens (Human))
University Of Akron
Curated by ChEMBL
LigandPNGBDBM50187024(CHEMBL412723)
Affinity DataIC50:  2.00E+3nM. Assay description: Inhibition of human SIRT1
In DepthDetails ArticlePubMed