BDBM50187138 3-cyclohexyl-1-(2-(dimethylamino)-2-oxoethyl)-2-phenyl-1H-pyrrolo[2,3-b]pyridine-6-carboxylic acid::CHEMBL378758
SMILES CN(C)C(=O)Cn1c(c(C2CCCCC2)c2ccc(nc12)C(O)=O)-c1ccccc1
InChI Key InChIKey=KJSPMONKFSRIFL-UHFFFAOYSA-N
Data  1 IC50
  Tab Delimited (TSV)   2D SDfile   Computed 3D by Vconf -m prep SDfile
Find this compound or compounds like it in BindingDB:
Activity Spreadsheet -- Enzyme Inhibition Constant Data from BindingDB
Found 1 hit for monomerid = 50187138
TargetRNA-directed RNA polymerase(Hepatitis C virus)
Mrl Rome
Curated by ChEMBL
LigandPNGBDBM50187138(3-cyclohexyl-1-(2-(dimethylamino)-2-oxoethyl)-2-ph...)
Affinity DataIC50:  320nM. Assay description: Inhibition of HCV BK NS5B deltaC55 RNA dependent RNA polymerase
In DepthDetails ArticlePubMed