BDBM50187200 CHEMBL3823197
SMILES O=C(CCc1c[nH]c2ccccc12)NC1CCN(Cc2ccccc2)CC1
InChI Key InChIKey=PBCGIIRIOLOMJH-UHFFFAOYSA-N
Data  4 IC50
  Tab Delimited (TSV)   2D SDfile   Computed 3D by Vconf -m prep SDfile
Find this compound or compounds like it in BindingDB:
Activity Spreadsheet -- Enzyme Inhibition Constant Data from BindingDB
Found 4 hits for monomerid = 50187200
TargetAcetylcholinesterase(Electrophorus electricus (Electric eel))
China Pharmaceutical University
Curated by ChEMBL
LigandPNGBDBM50187200(CHEMBL3823197)
Affinity DataIC50:  5.75E+3nM. Assay description: Inhibition of electric eel ACHE preincubated for 6 mins followed by addition of acetylcholine iodide as substrate by Ellman's method
In DepthDetails ArticlePubMed
TargetCholinesterase(Homo sapiens (Human))
China Pharmaceutical University
Curated by ChEMBL
LigandPNGBDBM50187200(CHEMBL3823197)
Affinity DataIC50:  120nM. Assay description: Inhibition of human serum BCHE preincubated for 6 mins followed by addition of S-butyrylcholine iodide as substrate by Ellman's method
In DepthDetails ArticlePubMed
TargetAcetylcholinesterase(Homo sapiens (Human))
China Pharmaceutical University
Curated by ChEMBL
LigandPNGBDBM50187200(CHEMBL3823197)
Affinity DataIC50:  8.32E+3nM. Assay description: Inhibition of human erythrocyte ACHE preincubated for 6 mins followed by addition of acetylcholine iodide as substrate by Ellman's method
In DepthDetails ArticlePubMed
TargetCholinesterase(Equus caballus (Horse))
China Pharmaceutical University
Curated by ChEMBL
LigandPNGBDBM50187200(CHEMBL3823197)
Affinity DataIC50:  370nM. Assay description: Inhibition of equine BCHE preincubated for 6 mins followed by addition of S-butyrylcholine iodide as substrate by Ellman's method
In DepthDetails ArticlePubMed