BDBM50187206 CHEMBL3822559
SMILES O=C(CC1CCN(Cc2ccccc2)CC1)NCCc1c[nH]c2ccccc12
InChI Key InChIKey=PDZMHDSORBHDFP-UHFFFAOYSA-N
Data  4 IC50
  Tab Delimited (TSV)   2D SDfile   Computed 3D by Vconf -m prep SDfile
Find this compound or compounds like it in BindingDB:
Activity Spreadsheet -- Enzyme Inhibition Constant Data from BindingDB
Found 4 hits for monomerid = 50187206
TargetAcetylcholinesterase(Electrophorus electricus (Electric eel))
China Pharmaceutical University
Curated by ChEMBL
LigandPNGBDBM50187206(CHEMBL3822559)
Affinity DataIC50:  2.10E+3nM. Assay description: Inhibition of electric eel ACHE preincubated for 6 mins followed by addition of acetylcholine iodide as substrate by Ellman's method
In DepthDetails ArticlePubMed
TargetCholinesterase(Homo sapiens (Human))
China Pharmaceutical University
Curated by ChEMBL
LigandPNGBDBM50187206(CHEMBL3822559)
Affinity DataIC50:  950nM. Assay description: Inhibition of human serum BCHE preincubated for 6 mins followed by addition of S-butyrylcholine iodide as substrate by Ellman's method
In DepthDetails ArticlePubMed
TargetAcetylcholinesterase(Homo sapiens (Human))
China Pharmaceutical University
Curated by ChEMBL
LigandPNGBDBM50187206(CHEMBL3822559)
Affinity DataIC50:  3.80E+3nM. Assay description: Inhibition of human erythrocyte ACHE preincubated for 6 mins followed by addition of acetylcholine iodide as substrate by Ellman's method
In DepthDetails ArticlePubMed
TargetCholinesterase(Equus caballus (Horse))
China Pharmaceutical University
Curated by ChEMBL
LigandPNGBDBM50187206(CHEMBL3822559)
Affinity DataIC50:  1.10E+3nM. Assay description: Inhibition of equine BCHE preincubated for 6 mins followed by addition of S-butyrylcholine iodide as substrate by Ellman's method
In DepthDetails ArticlePubMed