BDBM50187464 CHEMBL3828068
SMILES COC(NC(=O)C(NC(=O)C(CCCc1ccc(c(C)c1)-c1ccccc1)CC(O)=O)C(C)(C)C)c1ccccc1
InChI Key InChIKey=FOOIUOKCYUZPDW-UHFFFAOYSA-N
Data  2 IC50
  Tab Delimited (TSV)   2D SDfile   Computed 3D by Vconf -m prep SDfile
Find this compound or compounds like it in BindingDB:
Activity Spreadsheet -- Enzyme Inhibition Constant Data from BindingDB
Found 2 hits for monomerid = 50187464
Target72 kDa type IV collagenase(Homo sapiens (Human))
Jadavpur University
Curated by ChEMBL
LigandPNGBDBM50187464(CHEMBL3828068)
Affinity DataIC50:  3.42E+4nM. Assay description: Inhibition of human recombinant MMP2 by colorimetric analysis
In DepthDetails ArticlePubMed
Target72 kDa type IV collagenase(Homo sapiens (Human))
Jadavpur University
Curated by ChEMBL
LigandPNGBDBM50187464(CHEMBL3828068)
Affinity DataIC50:  3.42E+4nM. Assay description: Inhibition of human recombinant MMP2 by colorimetric analysis
In DepthDetails ArticlePubMed