BDBM50187498 CHEMBL3828195
SMILES CCOC(=O)c1c2CCCCc2sc1\N=C1/SC(CC(O)=O)C(=O)N1CC=C
InChI Key InChIKey=WEPQKTOMDZFBCT-VXPUYCOJSA-N
Data  1 IC50
  Tab Delimited (TSV)   2D SDfile   Computed 3D by Vconf -m prep SDfile
Find this compound or compounds like it in BindingDB:
Activity Spreadsheet -- Enzyme Inhibition Constant Data from BindingDB
Found 1 hit for monomerid = 50187498
TargetCruzipain(Trypanosoma cruzi)
Federal University Of Alagoas
Curated by ChEMBL
LigandPNGBDBM50187498(CHEMBL3828195)
Affinity DataIC50:  5.00E+4nM. Assay description: Inhibition of Trypanosoma cruzi cruzain using Z-Phe-Arg-aminomethylcoumarin as substrate measured after 5 mins by spectrofluorimetry
In DepthDetails ArticlePubMed