BDBM50187584 CHEMBL3827187
SMILES CCCCn1c2nc3N(CCCn3c2c(=O)n(CCCC)c1=O)c1ccc(OCCN(CC)CC)cc1
InChI Key InChIKey=JSUVPCPAVPGBBK-UHFFFAOYSA-N
Data  8 KI
  Tab Delimited (TSV)   2D SDfile   Computed 3D by Vconf -m prep SDfile
Find this compound or compounds like it in BindingDB:
Activity Spreadsheet -- Enzyme Inhibition Constant Data from BindingDB
Found 8 hits for monomerid = 50187584
TargetAdenosine receptor A1(Rattus norvegicus (rat))
Jagiellonian University Medical College
Curated by ChEMBL
LigandPNGBDBM50187584(CHEMBL3827187)
Affinity DataKi:  137nM. Assay description: Displacement of [3H]CCPA from adenosine receptor A1 in rat brain cortical membranes
In DepthDetails ArticlePubMed
TargetAdenosine receptor A3(Homo sapiens (Human))
Jagiellonian University Medical College
Curated by ChEMBL
LigandPNGBDBM50187584(CHEMBL3827187)
Affinity DataKi: >1.00E+3nM. Assay description: Displacement of [3H]PSB-603 from recombinant human adenosine receptor A3 expressed in CHO cell membranes
In DepthDetails ArticlePubMed
TargetAdenosine receptor A3(Rattus norvegicus)
Jagiellonian University Medical College
Curated by ChEMBL
LigandPNGBDBM50187584(CHEMBL3827187)
Affinity DataKi: >1.00E+3nM. Assay description: Displacement of [3H]NECA from recombinant rat adenosine receptor A3 expressed in CHO cell membranes
In DepthDetails ArticlePubMed
TargetAdenosine receptor A2b(Rattus norvegicus)
Jagiellonian University Medical College
Curated by ChEMBL
LigandPNGBDBM50187584(CHEMBL3827187)
Affinity DataKi: >1.00E+3nM. Assay description: Displacement of [3H]PSB-603 from recombinant rat adenosine receptor A2b expressed in CHO cell membranes
In DepthDetails ArticlePubMed
TargetAdenosine receptor A2b(Homo sapiens (Human))
Jagiellonian University Medical College
Curated by ChEMBL
LigandPNGBDBM50187584(CHEMBL3827187)
Affinity DataKi: >1.00E+3nM. Assay description: Displacement of [3H]PSB-603 from recombinant human adenosine receptor A2b expressed in CHO cell membranes
In DepthDetails ArticlePubMed
TargetAdenosine receptor A2a(Homo sapiens (Human))
Jagiellonian University Medical College
Curated by ChEMBL
LigandPNGBDBM50187584(CHEMBL3827187)
Affinity DataKi:  1.01E+3nM. Assay description: Displacement of [3H]MSX2 from recombinant human adenosine receptor A2a expressed in CHO cell membranes
In DepthDetails ArticlePubMed
TargetAdenosine receptor A1(Homo sapiens (Human))
Jagiellonian University Medical College
Curated by ChEMBL
LigandPNGBDBM50187584(CHEMBL3827187)
Affinity DataKi:  1.19E+3nM. Assay description: Displacement of [3H]CCPA from recombinant human adenosine receptor A1 expressed in CHO cell membranes
In DepthDetails ArticlePubMed
TargetAdenosine receptor A2a(Rattus norvegicus (rat))
Jagiellonian University Medical College
Curated by ChEMBL
LigandPNGBDBM50187584(CHEMBL3827187)
Affinity DataKi:  1.46E+3nM. Assay description: Displacement of [3H]MSX2 from adenosine receptor A2a in rat brain striatal membranes
In DepthDetails ArticlePubMed