BDBM50187840 3-hydroxy-5-(piperidin-1-yl)isothiazole-4-carbonitrile::CHEMBL378493
SMILES O=c1[nH]sc(N2CCCCC2)c1C#N
InChI Key InChIKey=SGZMCGSDVDVDDI-UHFFFAOYSA-N
Data  1 IC50
  Tab Delimited (TSV)   2D SDfile   Computed 3D by Vconf -m prep SDfile
Find this compound or compounds like it in BindingDB:
Activity Spreadsheet -- Enzyme Inhibition Constant Data from BindingDB
Found 1 hit for monomerid = 50187840
TargetDual specificity mitogen-activated protein kinase kinase 1(Homo sapiens (Human))
Valeant Pharmaceutical Research And Development
Curated by ChEMBL
LigandPNGBDBM50187840(3-hydroxy-5-(piperidin-1-yl)isothiazole-4-carbonit...)
Affinity DataIC50: >5.00E+3nM. Assay description: Inhibition of MEK1
In DepthDetails ArticlePubMed