BDBM50187884 (S)-1-(2-(2-chloro-6-(3-fluorophenylthio)phenoxy)ethyl)pyrrolidine-2-carboxylic acid::CHEMBL377815
SMILES OC(=O)[C@@H]1CCCN1CCOc1c(Cl)cccc1Sc1cccc(F)c1
InChI Key InChIKey=GIDPIFBFGXRAFU-INIZCTEOSA-N
Data  1 IC50
  Tab Delimited (TSV)   2D SDfile   Computed 3D by Vconf -m prep SDfile
Find this compound or compounds like it in BindingDB:
Activity Spreadsheet -- Enzyme Inhibition Constant Data from BindingDB
Found 1 hit for monomerid = 50187884
TargetSodium- and chloride-dependent glycine transporter 1(Homo sapiens (Human))
H. Lundbeck
Curated by ChEMBL
LigandPNGBDBM50187884((S)-1-(2-(2-chloro-6-(3-fluorophenylthio)phenoxy)e...)
Affinity DataIC50:  1.90E+4nM. Assay description: Inhibition of [3H]glycine uptake at human GlyT1b transporter
In DepthDetails ArticlePubMed