BDBM50187942 CHEMBL380106::rac-9a-butyl-8,9,9a,10-tetrahydroindeno[2,1-e]indazol-7(3H)-one
SMILES CCCCC12Cc3c(ccc4[nH]ncc34)C1=CC(=O)CC2
InChI Key InChIKey=XEVVSPUXPVYCOM-UHFFFAOYSA-N
Data  2 IC50
  Tab Delimited (TSV)   2D SDfile   Computed 3D by Vconf -m prep SDfile
Find this compound or compounds like it in BindingDB:
Activity Spreadsheet -- Enzyme Inhibition Constant Data from BindingDB
Found 2 hits for monomerid = 50187942
TargetEstrogen receptor beta(Homo sapiens (Human))
Merck Research Laboratories
Curated by ChEMBL
LigandPNGBDBM50187942(CHEMBL380106 | rac-9a-butyl-8,9,9a,10-tetrahydroin...)
Affinity DataIC50:  283nM. Assay description: Binding affinity to human ERbeta
In DepthDetails ArticlePubMed
TargetEstrogen receptor(Homo sapiens (Human))
Merck Research Laboratories
Curated by ChEMBL
LigandPNGBDBM50187942(CHEMBL380106 | rac-9a-butyl-8,9,9a,10-tetrahydroin...)
Affinity DataIC50: >1.00E+4nM. Assay description: Binding affinity to human ERalpha
In DepthDetails ArticlePubMed